Skip to main content.
home | support | download

Back to List Archive

[swish-e] configure with zlib

From: Geoffrey Petrie <gpetrie(at)not-real.unm.edu>
Date: Wed Aug 20 2008 - 21:02:41 GMT
Good afternoon,

I'm having some issues trying to build Swish-e 2.4.5 on a RedHat 5 
server with zlib.  When I attempt to configure initially I am left 
without zlib support.  When I configure using:

CCPFLAGS=-I/usr/lib/syslinux/com32/include/ ./configure

I am able to get zlib support according to the config log but I am left 
with several errors while building and won't pass any tests through the 
make check process.

/usr/lib/syslinux/com32/include/ appears to be the path to reach zlib.h, 
which is what's seems to be missing when I attempt to configure initially.

I am pasting the config.log produced from the command above and I'm also 
including the details provided when I attempt to build from that 
configuration.

Any help solving this issue would be greatly appreciated.

Thank you for your time.

Sincerely,
Geoff

uname -a
Linux server.server.com 2.6.18-92.1.10.el5 #1 SMP Wed Jul 23 03:55:54 
EDT 2008 i686 i686 i386 GNU/Linux

config.log

This file contains any messages produced by compilers while
running configure, to aid debugging if configure makes a mistake.

It was created by configure, which was
generated by GNU Autoconf 2.61.  Invocation command line was

  $ ./configure

## --------- ##
## Platform. ##
## --------- ##

hostname = server.server.com
uname -m = i686
uname -r = 2.6.18-92.1.10.el5
uname -s = Linux
uname -v = #1 SMP Wed Jul 23 03:55:54 EDT 2008

/usr/bin/uname -p = unknown
/bin/uname -X     = unknown

/bin/arch              = i686
/usr/bin/arch -k       = unknown
/usr/convex/getsysinfo = unknown
/usr/bin/hostinfo      = unknown
/bin/machine           = unknown
/usr/bin/oslevel       = unknown
/bin/universe          = unknown

PATH: /usr/kerberos/bin
PATH: /usr/local/bin
PATH: /bin
PATH: /usr/bin
PATH: /home/[directory]/bin


## ----------- ##
## Core tests. ##
## ----------- ##

configure:2046: checking for build-swish-docs
configure:2079: result: no
configure:2174: checking for a BSD-compatible install
configure:2230: result: /usr/bin/install -c
configure:2241: checking whether build environment is sane
configure:2284: result: yes
configure:2349: checking for gawk
configure:2365: found /bin/gawk
configure:2376: result: gawk
configure:2387: checking whether make sets $(MAKE)
configure:2408: result: yes
configure:2641: checking for gcc
configure:2657: found /usr/bin/gcc
configure:2668: result: gcc
configure:2906: checking for C compiler version
configure:2913: gcc --version >&5
gcc (GCC) 4.1.2 20071124 (Red Hat 4.1.2-42)
Copyright (C) 2006 Free Software Foundation, Inc.
This is free software; see the source for copying conditions.  There is NO
warranty; not even for MERCHANTABILITY or FITNESS FOR A PARTICULAR PURPOSE.

configure:2916: $? = 0
configure:2923: gcc -v >&5
Using built-in specs.
Target: i386-redhat-linux
Configured with: ../configure --prefix=/usr --mandir=/usr/share/man 
--infodir=/usr/share/info --enable-shared --enable-threads=posix 
--enable-checking=release --with-system-zlib --enable-__cxa_atexit 
--disable-libunwind-exceptions --enable-libgcj-multifile 
--enable-languages=c,c++,objc,obj-c++,java,fortran,ada 
--enable-java-awt=gtk --disable-dssi --enable-plugin 
--with-java-home=/usr/lib/jvm/java-1.4.2-gcj-1.4.2.0/jre 
--with-cpu=generic --host=i386-redhat-linux
Thread model: posix
gcc version 4.1.2 20071124 (Red Hat 4.1.2-42)
configure:2926: $? = 0
configure:2933: gcc -V >&5
gcc: '-V' option must have argument
configure:2936: $? = 1
configure:2959: checking for C compiler default output file name
configure:2986: gcc  -I/usr/lib/syslinux/com32/include/  conftest.c  >&5
configure:2989: $? = 0
configure:3027: result: a.out
configure:3044: checking whether the C compiler works
configure:3054: ./a.out
configure:3057: $? = 0
configure:3074: result: yes
configure:3081: checking whether we are cross compiling
configure:3083: result: no
configure:3086: checking for suffix of executables
configure:3093: gcc -o conftest  -I/usr/lib/syslinux/com32/include/  
conftest.c  >&5
configure:3096: $? = 0
configure:3120: result:
configure:3126: checking for suffix of object files
configure:3152: gcc -c  -I/usr/lib/syslinux/com32/include/ conftest.c >&5
configure:3155: $? = 0
configure:3178: result: o
configure:3182: checking whether we are using the GNU C compiler
configure:3211: gcc -c  -I/usr/lib/syslinux/com32/include/ conftest.c >&5
configure:3217: $? = 0
configure:3234: result: yes
configure:3239: checking whether gcc accepts -g
configure:3269: gcc -c -g -I/usr/lib/syslinux/com32/include/ conftest.c >&5
configure:3275: $? = 0
configure:3374: result: yes
configure:3391: checking for gcc option to accept ISO C89
configure:3465: gcc  -c -g -O2 -I/usr/lib/syslinux/com32/include/ 
conftest.c >&5
conftest.c:16: warning: 'struct stat' declared inside parameter list
conftest.c:16: warning: its scope is only this definition or 
declaration, which is probably not what you want
conftest.c:50: warning: 'struct stat' declared inside parameter list
configure:3471: $? = 0
configure:3494: result: none needed
configure:3523: checking for style of include used by make
configure:3551: result: GNU
configure:3579: checking dependency style of gcc
configure:3669: result: gcc3
configure:3734: checking for gcc
configure:3761: result: gcc
configure:3999: checking for C compiler version
configure:4006: gcc --version >&5
gcc (GCC) 4.1.2 20071124 (Red Hat 4.1.2-42)
Copyright (C) 2006 Free Software Foundation, Inc.
This is free software; see the source for copying conditions.  There is NO
warranty; not even for MERCHANTABILITY or FITNESS FOR A PARTICULAR PURPOSE.

configure:4009: $? = 0
configure:4016: gcc -v >&5
Using built-in specs.
Target: i386-redhat-linux
Configured with: ../configure --prefix=/usr --mandir=/usr/share/man 
--infodir=/usr/share/info --enable-shared --enable-threads=posix 
--enable-checking=release --with-system-zlib --enable-__cxa_atexit 
--disable-libunwind-exceptions --enable-libgcj-multifile 
--enable-languages=c,c++,objc,obj-c++,java,fortran,ada 
--enable-java-awt=gtk --disable-dssi --enable-plugin 
--with-java-home=/usr/lib/jvm/java-1.4.2-gcj-1.4.2.0/jre 
--with-cpu=generic --host=i386-redhat-linux
Thread model: posix
gcc version 4.1.2 20071124 (Red Hat 4.1.2-42)
configure:4019: $? = 0
configure:4026: gcc -V >&5
gcc: '-V' option must have argument
configure:4029: $? = 1
configure:4032: checking whether we are using the GNU C compiler
configure:4084: result: yes
configure:4089: checking whether gcc accepts -g
configure:4224: result: yes
configure:4241: checking for gcc option to accept ISO C89
configure:4344: result: none needed
configure:4364: checking dependency style of gcc
configure:4454: result: gcc3
configure:4475: checking for an ANSI C-conforming const
configure:4550: gcc -c -g -O2 -I/usr/lib/syslinux/com32/include/ 
conftest.c >&5
configure:4556: $? = 0
configure:4571: result: yes
configure:4661: checking build system type
configure:4679: result: i686-pc-linux-gnu
configure:4701: checking host system type
configure:4716: result: i686-pc-linux-gnu
configure:4738: checking for a sed that does not truncate output
configure:4792: result: /bin/sed
configure:4795: checking for grep that handles long lines and -e
configure:4869: result: /bin/grep
configure:4874: checking for egrep
configure:4952: result: /bin/grep -E
configure:4968: checking for ld used by gcc
configure:5035: result: /usr/bin/ld
configure:5044: checking if the linker (/usr/bin/ld) is GNU ld
configure:5059: result: yes
configure:5064: checking for /usr/bin/ld option to reload object files
configure:5071: result: -r
configure:5089: checking for BSD-compatible nm
configure:5138: result: /usr/bin/nm -B
configure:5142: checking whether ln -s works
configure:5146: result: yes
configure:5153: checking how to recognise dependent libraries
configure:5329: result: pass_all
configure:5852: checking how to run the C preprocessor
configure:5892: gcc -E -I/usr/lib/syslinux/com32/include/ conftest.c
configure:5898: $? = 0
configure:5929: gcc -E -I/usr/lib/syslinux/com32/include/ conftest.c
conftest.c:10:28: error: ac_nonexistent.h: No such file or directory
configure:5935: $? = 1
configure: failed program was:
| /* confdefs.h.  */
| #define PACKAGE_NAME ""
| #define PACKAGE_TARNAME ""
| #define PACKAGE_VERSION ""
| #define PACKAGE_STRING ""
| #define PACKAGE_BUGREPORT ""
| #define PACKAGE "swish-e"
| #define VERSION "2.4.5"
| /* end confdefs.h.  */
| #include <ac_nonexistent.h>
configure:5968: result: gcc -E
configure:5997: gcc -E -I/usr/lib/syslinux/com32/include/ conftest.c
configure:6003: $? = 0
configure:6034: gcc -E -I/usr/lib/syslinux/com32/include/ conftest.c
conftest.c:10:28: error: ac_nonexistent.h: No such file or directory
configure:6040: $? = 1
configure: failed program was:
| /* confdefs.h.  */
| #define PACKAGE_NAME ""
| #define PACKAGE_TARNAME ""
| #define PACKAGE_VERSION ""
| #define PACKAGE_STRING ""
| #define PACKAGE_BUGREPORT ""
| #define PACKAGE "swish-e"
| #define VERSION "2.4.5"
| /* end confdefs.h.  */
| #include <ac_nonexistent.h>
configure:6078: checking for ANSI C header files
configure:6108: gcc -c -g -O2 -I/usr/lib/syslinux/com32/include/ 
conftest.c >&5
configure:6114: $? = 0
configure:6213: gcc -o conftest -g -O2 
-I/usr/lib/syslinux/com32/include/  conftest.c  >&5
/tmp/ccyiSQQc.o: In function `main':
/home/[directory]/swish-e-2.4.5/conftest.c:26: undefined reference to 
`__ctypes'
collect2: ld returned 1 exit status
configure:6216: $? = 1
configure: program exited with status 1
configure: failed program was:
| /* confdefs.h.  */
| #define PACKAGE_NAME ""
| #define PACKAGE_TARNAME ""
| #define PACKAGE_VERSION ""
| #define PACKAGE_STRING ""
| #define PACKAGE_BUGREPORT ""
| #define PACKAGE "swish-e"
| #define VERSION "2.4.5"
| /* end confdefs.h.  */
| #include <ctype.h>
| #include <stdlib.h>
| #if ((' ' & 0x0FF) == 0x020)
| # define ISLOWER(c) ('a' <= (c) && (c) <= 'z')
| # define TOUPPER(c) (ISLOWER(c) ? 'A' + ((c) - 'a') : (c))
| #else
| # define ISLOWER(c)            (('a' <= (c) && (c) <= 'i')         
     || ('j' <= (c) && (c) <= 'r')              || ('s' <= (c) && (c) <= 
'z'))
| # define TOUPPER(c) (ISLOWER(c) ? ((c) | 0x40) : (c))
| #endif
|
| #define XOR(e, f) (((e) && !(f)) || (!(e) && (f)))
| int
| main ()
| {
|   int i;
|   for (i = 0; i < 256; i++)
|     if (XOR (islower (i), ISLOWER (i))
|     || toupper (i) != TOUPPER (i))
|       return 2;
|   return 0;
| }
configure:6242: result: no
configure:6266: checking for sys/types.h
configure:6287: gcc -c -g -O2 -I/usr/lib/syslinux/com32/include/ 
conftest.c >&5
configure:6293: $? = 0
configure:6309: result: yes
configure:6266: checking for sys/stat.h
configure:6287: gcc -c -g -O2 -I/usr/lib/syslinux/com32/include/ 
conftest.c >&5
configure:6293: $? = 0
configure:6309: result: yes
configure:6266: checking for stdlib.h
configure:6287: gcc -c -g -O2 -I/usr/lib/syslinux/com32/include/ 
conftest.c >&5
configure:6293: $? = 0
configure:6309: result: yes
configure:6266: checking for string.h
configure:6287: gcc -c -g -O2 -I/usr/lib/syslinux/com32/include/ 
conftest.c >&5
configure:6293: $? = 0
configure:6309: result: yes
configure:6266: checking for memory.h
configure:6287: gcc -c -g -O2 -I/usr/lib/syslinux/com32/include/ 
conftest.c >&5
configure:6293: $? = 0
configure:6309: result: yes
configure:6266: checking for strings.h
configure:6287: gcc -c -g -O2 -I/usr/lib/syslinux/com32/include/ 
conftest.c >&5
configure:6293: $? = 0
configure:6309: result: yes
configure:6266: checking for inttypes.h
configure:6287: gcc -c -g -O2 -I/usr/lib/syslinux/com32/include/ 
conftest.c >&5
configure:6293: $? = 0
configure:6309: result: yes
configure:6266: checking for stdint.h
configure:6287: gcc -c -g -O2 -I/usr/lib/syslinux/com32/include/ 
conftest.c >&5
configure:6293: $? = 0
configure:6309: result: yes
configure:6266: checking for unistd.h
configure:6287: gcc -c -g -O2 -I/usr/lib/syslinux/com32/include/ 
conftest.c >&5
configure:6293: $? = 0
configure:6309: result: yes
configure:6336: checking dlfcn.h usability
configure:6353: gcc -c -g -O2 -I/usr/lib/syslinux/com32/include/ 
conftest.c >&5
configure:6359: $? = 0
configure:6373: result: yes
configure:6377: checking dlfcn.h presence
configure:6392: gcc -E -I/usr/lib/syslinux/com32/include/ conftest.c
configure:6398: $? = 0
configure:6412: result: yes
configure:6440: checking for dlfcn.h
configure:6448: result: yes
configure:6519: checking for g++
configure:6549: result: no
configure:6519: checking for c++
configure:6549: result: no
configure:6519: checking for gpp
configure:6549: result: no
configure:6519: checking for aCC
configure:6549: result: no
configure:6519: checking for CC
configure:6549: result: no
configure:6519: checking for cxx
configure:6549: result: no
configure:6519: checking for cc++
configure:6549: result: no
configure:6519: checking for cl.exe
configure:6549: result: no
configure:6519: checking for FCC
configure:6549: result: no
configure:6519: checking for KCC
configure:6549: result: no
configure:6519: checking for RCC
configure:6549: result: no
configure:6519: checking for xlC_r
configure:6549: result: no
configure:6519: checking for xlC
configure:6549: result: no
configure:6577: checking for C++ compiler version
configure:6584: g++ --version >&5
./configure: line 6585: g++: command not found
configure:6587: $? = 127
configure:6594: g++ -v >&5
./configure: line 6595: g++: command not found
configure:6597: $? = 127
configure:6604: g++ -V >&5
./configure: line 6605: g++: command not found
configure:6607: $? = 127
configure:6610: checking whether we are using the GNU C++ compiler
configure:6639: g++ -c  -I/usr/lib/syslinux/com32/include/ conftest.cpp >&5
./configure: line 6640: g++: command not found
configure:6645: $? = 127
configure: failed program was:
| /* confdefs.h.  */
| #define PACKAGE_NAME ""
| #define PACKAGE_TARNAME ""
| #define PACKAGE_VERSION ""
| #define PACKAGE_STRING ""
| #define PACKAGE_BUGREPORT ""
| #define PACKAGE "swish-e"
| #define VERSION "2.4.5"
| #define HAVE_SYS_TYPES_H 1
| #define HAVE_SYS_STAT_H 1
| #define HAVE_STDLIB_H 1
| #define HAVE_STRING_H 1
| #define HAVE_MEMORY_H 1
| #define HAVE_STRINGS_H 1
| #define HAVE_INTTYPES_H 1
| #define HAVE_STDINT_H 1
| #define HAVE_UNISTD_H 1
| #define HAVE_DLFCN_H 1
| /* end confdefs.h.  */
|
| int
| main ()
| {
| #ifndef __GNUC__
|        choke me
| #endif
|
|   ;
|   return 0;
| }
configure:6662: result: no
configure:6667: checking whether g++ accepts -g
configure:6697: g++ -c -g -I/usr/lib/syslinux/com32/include/ 
conftest.cpp >&5
./configure: line 6698: g++: command not found
configure:6703: $? = 127
configure: failed program was:
| /* confdefs.h.  */
| #define PACKAGE_NAME ""
| #define PACKAGE_TARNAME ""
| #define PACKAGE_VERSION ""
| #define PACKAGE_STRING ""
| #define PACKAGE_BUGREPORT ""
| #define PACKAGE "swish-e"
| #define VERSION "2.4.5"
| #define HAVE_SYS_TYPES_H 1
| #define HAVE_SYS_STAT_H 1
| #define HAVE_STDLIB_H 1
| #define HAVE_STRING_H 1
| #define HAVE_MEMORY_H 1
| #define HAVE_STRINGS_H 1
| #define HAVE_INTTYPES_H 1
| #define HAVE_STDINT_H 1
| #define HAVE_UNISTD_H 1
| #define HAVE_DLFCN_H 1
| /* end confdefs.h.  */
|
| int
| main ()
| {
|
|   ;
|   return 0;
| }
configure:6735: g++ -c  -I/usr/lib/syslinux/com32/include/ conftest.cpp >&5
./configure: line 6736: g++: command not found
configure:6741: $? = 127
configure: failed program was:
| /* confdefs.h.  */
| #define PACKAGE_NAME ""
| #define PACKAGE_TARNAME ""
| #define PACKAGE_VERSION ""
| #define PACKAGE_STRING ""
| #define PACKAGE_BUGREPORT ""
| #define PACKAGE "swish-e"
| #define VERSION "2.4.5"
| #define HAVE_SYS_TYPES_H 1
| #define HAVE_SYS_STAT_H 1
| #define HAVE_STDLIB_H 1
| #define HAVE_STRING_H 1
| #define HAVE_MEMORY_H 1
| #define HAVE_STRINGS_H 1
| #define HAVE_INTTYPES_H 1
| #define HAVE_STDINT_H 1
| #define HAVE_UNISTD_H 1
| #define HAVE_DLFCN_H 1
| /* end confdefs.h.  */
|
| int
| main ()
| {
|
|   ;
|   return 0;
| }
configure:6774: g++ -c -g -I/usr/lib/syslinux/com32/include/ 
conftest.cpp >&5
./configure: line 6775: g++: command not found
configure:6780: $? = 127
configure: failed program was:
| /* confdefs.h.  */
| #define PACKAGE_NAME ""
| #define PACKAGE_TARNAME ""
| #define PACKAGE_VERSION ""
| #define PACKAGE_STRING ""
| #define PACKAGE_BUGREPORT ""
| #define PACKAGE "swish-e"
| #define VERSION "2.4.5"
| #define HAVE_SYS_TYPES_H 1
| #define HAVE_SYS_STAT_H 1
| #define HAVE_STDLIB_H 1
| #define HAVE_STRING_H 1
| #define HAVE_MEMORY_H 1
| #define HAVE_STRINGS_H 1
| #define HAVE_INTTYPES_H 1
| #define HAVE_STDINT_H 1
| #define HAVE_UNISTD_H 1
| #define HAVE_DLFCN_H 1
| /* end confdefs.h.  */
|
| int
| main ()
| {
|
|   ;
|   return 0;
| }
configure:6802: result: no
configure:6827: checking dependency style of g++
configure:6917: result: none
configure:7221: checking for g77
configure:7251: result: no
configure:7221: checking for xlf
configure:7251: result: no
configure:7221: checking for f77
configure:7251: result: no
configure:7221: checking for frt
configure:7251: result: no
configure:7221: checking for pgf77
configure:7251: result: no
configure:7221: checking for cf77
configure:7251: result: no
configure:7221: checking for fort77
configure:7251: result: no
configure:7221: checking for fl32
configure:7251: result: no
configure:7221: checking for af77
configure:7251: result: no
configure:7221: checking for xlf90
configure:7251: result: no
configure:7221: checking for f90
configure:7251: result: no
configure:7221: checking for pgf90
configure:7251: result: no
configure:7221: checking for pghpf
configure:7251: result: no
configure:7221: checking for epcf90
configure:7251: result: no
configure:7221: checking for gfortran
configure:7251: result: no
configure:7221: checking for g95
configure:7251: result: no
configure:7221: checking for xlf95
configure:7251: result: no
configure:7221: checking for f95
configure:7251: result: no
configure:7221: checking for fort
configure:7251: result: no
configure:7221: checking for ifort
configure:7251: result: no
configure:7221: checking for ifc
configure:7251: result: no
configure:7221: checking for efc
configure:7251: result: no
configure:7221: checking for pgf95
configure:7251: result: no
configure:7221: checking for lf95
configure:7251: result: no
configure:7221: checking for ftn
configure:7251: result: no
configure:7278: checking for Fortran 77 compiler version
configure:7285:  --version >&5
./configure: line 7286: --version: command not found
configure:7288: $? = 127
configure:7295:  -v >&5
./configure: line 7296: -v: command not found
configure:7298: $? = 127
configure:7305:  -V >&5
./configure: line 7306: -V: command not found
configure:7308: $? = 127
configure:7316: checking whether we are using the GNU Fortran 77 compiler
configure:7335:  -c  conftest.F >&5
./configure: line 7336: -c: command not found
configure:7341: $? = 127
configure: failed program was:
|       program main
| #ifndef __GNUC__
|        choke me
| #endif
|
|       end
configure:7358: result: no
configure:7364: checking whether  accepts -g
configure:7381:  -c -g conftest.f >&5
./configure: line 7382: -c: command not found
configure:7387: $? = 127
configure: failed program was:
|       program main
|
|       end
configure:7403: result: no
configure:7433: checking the maximum length of command line arguments
configure:7542: result: 32768
configure:7553: checking command to parse /usr/bin/nm -B output from gcc 
object
configure:7658: gcc -c -g -O2 -I/usr/lib/syslinux/com32/include/ 
conftest.c >&5
configure:7661: $? = 0
configure:7665: /usr/bin/nm -B conftest.o \| sed -n -e 's/^.*[     
]\([ABCDGIRSTW][ABCDGIRSTW]*\)[     ][     
]*\([_A-Za-z][_A-Za-z0-9]*\)$/\1 \2 \2/p' \> conftest.nm
configure:7668: $? = 0
configure:7720: gcc -o conftest -g -O2 
-I/usr/lib/syslinux/com32/include/  conftest.c conftstm.o >&5
configure:7723: $? = 0
configure:7761: result: ok
configure:7765: checking for objdir
configure:7780: result: .libs
configure:7872: checking for ar
configure:7888: found /usr/bin/ar
configure:7899: result: ar
configure:7968: checking for ranlib
configure:7984: found /usr/bin/ranlib
configure:7995: result: ranlib
configure:8064: checking for strip
configure:8080: found /usr/bin/strip
configure:8091: result: strip
configure:8377: checking if gcc supports -fno-rtti -fno-exceptions
configure:8395: gcc -c -g -O2 -I/usr/lib/syslinux/com32/include/ 
-fno-rtti -fno-exceptions conftest.c >&5
cc1: warning: command line option "-fno-rtti" is valid for C++/ObjC++ 
but not for C
configure:8399: $? = 0
configure:8412: result: no
configure:8427: checking for gcc option to produce PIC
configure:8637: result: -fPIC
configure:8645: checking if gcc PIC flag -fPIC works
configure:8663: gcc -c -g -O2 -I/usr/lib/syslinux/com32/include/ -fPIC 
-DPIC conftest.c >&5
configure:8667: $? = 0
configure:8680: result: yes
configure:8708: checking if gcc static flag -static works
configure:8736: result: yes
configure:8746: checking if gcc supports -c -o file.o
configure:8767: gcc -c -g -O2 -I/usr/lib/syslinux/com32/include/ -o 
out/conftest2.o conftest.c >&5
configure:8771: $? = 0
configure:8793: result: yes
configure:8819: checking whether the gcc linker (/usr/bin/ld) supports 
shared libraries
configure:9774: result: yes
configure:9795: checking whether -lc should be explicitly linked in
configure:9800: gcc -c -g -O2 -I/usr/lib/syslinux/com32/include/ 
conftest.c >&5
configure:9803: $? = 0
configure:9818: gcc -shared conftest.o  -v -Wl,-soname -Wl,conftest -o 
conftest 2\>\&1 \| grep  -lc  \>/dev/null 2\>\&1
configure:9821: $? = 0
configure:9833: result: no
configure:9841: checking dynamic linker characteristics
configure:10417: result: GNU/Linux ld.so
configure:10426: checking how to hardcode library paths into programs
configure:10451: result: immediate
configure:10465: checking whether stripping libraries is possible
configure:10470: result: yes
configure:11271: checking if libtool supports shared libraries
configure:11273: result: yes
configure:11276: checking whether to build shared libraries
configure:11297: result: yes
configure:11300: checking whether to build static libraries
configure:11304: result: yes
configure:11396: creating libtool
configure:20484: checking whether to enable maintainer-specific portions 
of Makefiles
configure:20493: result: no
configure:20511: checking for BSDgettimeofday
configure:20567: gcc -o conftest -g -O2 
-I/usr/lib/syslinux/com32/include/  conftest.c  >&5
/tmp/ccumDkxb.o: In function `main':
/home/[directory]/swish-e-2.4.5/conftest.c:54: undefined reference to 
`BSDgettimeofday'
collect2: ld returned 1 exit status
configure:20573: $? = 1
configure: failed program was:
| /* confdefs.h.  */
| #define PACKAGE_NAME ""
| #define PACKAGE_TARNAME ""
| #define PACKAGE_VERSION ""
| #define PACKAGE_STRING ""
| #define PACKAGE_BUGREPORT ""
| #define PACKAGE "swish-e"
| #define VERSION "2.4.5"
| #define HAVE_SYS_TYPES_H 1
| #define HAVE_SYS_STAT_H 1
| #define HAVE_STDLIB_H 1
| #define HAVE_STRING_H 1
| #define HAVE_MEMORY_H 1
| #define HAVE_STRINGS_H 1
| #define HAVE_INTTYPES_H 1
| #define HAVE_STDINT_H 1
| #define HAVE_UNISTD_H 1
| #define HAVE_DLFCN_H 1
| /* end confdefs.h.  */
| /* Define BSDgettimeofday to an innocuous variant, in case <limits.h> 
declares BSDgettimeofday.
|    For example, HP-UX 11i <limits.h> declares gettimeofday.  */
| #define BSDgettimeofday innocuous_BSDgettimeofday
|
| /* System header to define __stub macros and hopefully few prototypes,
|     which can conflict with char BSDgettimeofday (); below.
|     Prefer <limits.h> to <assert.h> if __STDC__ is defined, since
|     <limits.h> exists even on freestanding compilers.  */
|
| #ifdef __STDC__
| # include <limits.h>
| #else
| # include <assert.h>
| #endif
|
| #undef BSDgettimeofday
|
| /* Override any GCC internal prototype to avoid an error.
|    Use char because int might match the return type of a GCC
|    builtin and then its argument prototype would still apply.  */
| #ifdef __cplusplus
| extern "C"
| #endif
| char BSDgettimeofday ();
| /* The GNU C library defines this for functions which it implements
|     to always fail with ENOSYS.  Some functions are actually named
|     something starting with __ and the normal name is an alias.  */
| #if defined __stub_BSDgettimeofday || defined __stub___BSDgettimeofday
| choke me
| #endif
|
| int
| main ()
| {
| return BSDgettimeofday ();
|   ;
|   return 0;
| }
configure:20590: result: no
configure:20599: checking for gettimeofday
configure:20655: gcc -o conftest -g -O2 
-I/usr/lib/syslinux/com32/include/  conftest.c  >&5
configure:20661: $? = 0
configure:20678: result: yes
configure:20696: checking whether #! works in shell scripts
configure:20713: result: yes
configure:20718: checking whether make sets $(MAKE)
configure:20739: result: yes
configure:20751: checking for perl
configure:20769: found /usr/bin/perl
configure:20782: result: /usr/bin/perl
configure:20798: checking for pod2man
configure:20814: found /usr/bin/pod2man
configure:20826: result: pod2man
configure:20852: checking for a BSD-compatible install
configure:20908: result: /usr/bin/install -c
configure:20969: checking for gcc
configure:20996: result: gcc
configure:21234: checking for C compiler version
configure:21241: gcc --version >&5
gcc (GCC) 4.1.2 20071124 (Red Hat 4.1.2-42)
Copyright (C) 2006 Free Software Foundation, Inc.
This is free software; see the source for copying conditions.  There is NO
warranty; not even for MERCHANTABILITY or FITNESS FOR A PARTICULAR PURPOSE.

configure:21244: $? = 0
configure:21251: gcc -v >&5
Using built-in specs.
Target: i386-redhat-linux
Configured with: ../configure --prefix=/usr --mandir=/usr/share/man 
--infodir=/usr/share/info --enable-shared --enable-threads=posix 
--enable-checking=release --with-system-zlib --enable-__cxa_atexit 
--disable-libunwind-exceptions --enable-libgcj-multifile 
--enable-languages=c,c++,objc,obj-c++,java,fortran,ada 
--enable-java-awt=gtk --disable-dssi --enable-plugin 
--with-java-home=/usr/lib/jvm/java-1.4.2-gcj-1.4.2.0/jre 
--with-cpu=generic --host=i386-redhat-linux
Thread model: posix
gcc version 4.1.2 20071124 (Red Hat 4.1.2-42)
configure:21254: $? = 0
configure:21261: gcc -V >&5
gcc: '-V' option must have argument
configure:21264: $? = 1
configure:21267: checking whether we are using the GNU C compiler
configure:21319: result: yes
configure:21324: checking whether gcc accepts -g
configure:21459: result: yes
configure:21476: checking for gcc option to accept ISO C89
configure:21579: result: none needed
configure:21599: checking dependency style of gcc
configure:21689: result: gcc3
configure:21708: checking for vsnprintf in -lsnprintf
configure:21743: gcc -o conftest -g -O2 
-I/usr/lib/syslinux/com32/include/  conftest.c -lsnprintf   >&5
conftest.c:27: warning: conflicting types for built-in function 'vsnprintf'
/usr/bin/ld: cannot find -lsnprintf
collect2: ld returned 1 exit status
configure:21749: $? = 1
configure: failed program was:
| /* confdefs.h.  */
| #define PACKAGE_NAME ""
| #define PACKAGE_TARNAME ""
| #define PACKAGE_VERSION ""
| #define PACKAGE_STRING ""
| #define PACKAGE_BUGREPORT ""
| #define PACKAGE "swish-e"
| #define VERSION "2.4.5"
| #define HAVE_SYS_TYPES_H 1
| #define HAVE_SYS_STAT_H 1
| #define HAVE_STDLIB_H 1
| #define HAVE_STRING_H 1
| #define HAVE_MEMORY_H 1
| #define HAVE_STRINGS_H 1
| #define HAVE_INTTYPES_H 1
| #define HAVE_STDINT_H 1
| #define HAVE_UNISTD_H 1
| #define HAVE_DLFCN_H 1
| /* end confdefs.h.  */
|
| /* Override any GCC internal prototype to avoid an error.
|    Use char because int might match the return type of a GCC
|    builtin and then its argument prototype would still apply.  */
| #ifdef __cplusplus
| extern "C"
| #endif
| char vsnprintf ();
| int
| main ()
| {
| return vsnprintf ();
|   ;
|   return 0;
| }
configure:21767: result: no
configure:21787: checking for dirent.h that defines DIR
configure:21816: gcc -c -g -O2 -I/usr/lib/syslinux/com32/include/ 
conftest.c >&5
configure:21822: $? = 0
configure:21838: result: yes
configure:21851: checking for library containing opendir
configure:21892: gcc -o conftest -g -O2 
-I/usr/lib/syslinux/com32/include/  conftest.c  >&5
configure:21898: $? = 0
configure:21926: result: none required
configure:22021: checking whether stat file-mode macros are broken
configure:22058: gcc -c -g -O2 -I/usr/lib/syslinux/com32/include/ 
conftest.c >&5
configure:22064: $? = 0
configure:22079: result: no
configure:22089: checking for ANSI C header files
configure:22253: result: no
configure:22273: checking for unistd.h
configure:22279: result: yes
configure:22273: checking for stdlib.h
configure:22279: result: yes
configure:22273: checking for string.h
configure:22279: result: yes
configure:22283: checking sys/timeb.h usability
configure:22300: gcc -c -g -O2 -I/usr/lib/syslinux/com32/include/ 
conftest.c >&5
configure:22306: $? = 0
configure:22320: result: yes
configure:22324: checking sys/timeb.h presence
configure:22339: gcc -E -I/usr/lib/syslinux/com32/include/ conftest.c
configure:22345: $? = 0
configure:22359: result: yes
configure:22387: checking for sys/timeb.h
configure:22395: result: yes
configure:22283: checking windows.h usability
configure:22300: gcc -c -g -O2 -I/usr/lib/syslinux/com32/include/ 
conftest.c >&5
conftest.c:58:21: error: windows.h: No such file or directory
configure:22306: $? = 1
configure: failed program was:
| /* confdefs.h.  */
| #define PACKAGE_NAME ""
| #define PACKAGE_TARNAME ""
| #define PACKAGE_VERSION ""
| #define PACKAGE_STRING ""
| #define PACKAGE_BUGREPORT ""
| #define PACKAGE "swish-e"
| #define VERSION "2.4.5"
| #define HAVE_SYS_TYPES_H 1
| #define HAVE_SYS_STAT_H 1
| #define HAVE_STDLIB_H 1
| #define HAVE_STRING_H 1
| #define HAVE_MEMORY_H 1
| #define HAVE_STRINGS_H 1
| #define HAVE_INTTYPES_H 1
| #define HAVE_STDINT_H 1
| #define HAVE_UNISTD_H 1
| #define HAVE_DLFCN_H 1
| #define HAVE_DIRENT_H 1
| #define HAVE_UNISTD_H 1
| #define HAVE_STDLIB_H 1
| #define HAVE_STRING_H 1
| #define HAVE_SYS_TIMEB_H 1
| /* end confdefs.h.  */
| #include <stdio.h>
| #ifdef HAVE_SYS_TYPES_H
| # include <sys/types.h>
| #endif
| #ifdef HAVE_SYS_STAT_H
| # include <sys/stat.h>
| #endif
| #ifdef STDC_HEADERS
| # include <stdlib.h>
| # include <stddef.h>
| #else
| # ifdef HAVE_STDLIB_H
| #  include <stdlib.h>
| # endif
| #endif
| #ifdef HAVE_STRING_H
| # if !defined STDC_HEADERS && defined HAVE_MEMORY_H
| #  include <memory.h>
| # endif
| # include <string.h>
| #endif
| #ifdef HAVE_STRINGS_H
| # include <strings.h>
| #endif
| #ifdef HAVE_INTTYPES_H
| # include <inttypes.h>
| #endif
| #ifdef HAVE_STDINT_H
| # include <stdint.h>
| #endif
| #ifdef HAVE_UNISTD_H
| # include <unistd.h>
| #endif
| #include <windows.h>
configure:22320: result: no
configure:22324: checking windows.h presence
configure:22339: gcc -E -I/usr/lib/syslinux/com32/include/ conftest.c
conftest.c:25:21: error: windows.h: No such file or directory
configure:22345: $? = 1
configure: failed program was:
| /* confdefs.h.  */
| #define PACKAGE_NAME ""
| #define PACKAGE_TARNAME ""
| #define PACKAGE_VERSION ""
| #define PACKAGE_STRING ""
| #define PACKAGE_BUGREPORT ""
| #define PACKAGE "swish-e"
| #define VERSION "2.4.5"
| #define HAVE_SYS_TYPES_H 1
| #define HAVE_SYS_STAT_H 1
| #define HAVE_STDLIB_H 1
| #define HAVE_STRING_H 1
| #define HAVE_MEMORY_H 1
| #define HAVE_STRINGS_H 1
| #define HAVE_INTTYPES_H 1
| #define HAVE_STDINT_H 1
| #define HAVE_UNISTD_H 1
| #define HAVE_DLFCN_H 1
| #define HAVE_DIRENT_H 1
| #define HAVE_UNISTD_H 1
| #define HAVE_STDLIB_H 1
| #define HAVE_STRING_H 1
| #define HAVE_SYS_TIMEB_H 1
| /* end confdefs.h.  */
| #include <windows.h>
configure:22359: result: no
configure:22387: checking for windows.h
configure:22395: result: no
configure:22424: checking sys/resource.h usability
configure:22441: gcc -c -g -O2 -I/usr/lib/syslinux/com32/include/ 
conftest.c >&5
configure:22447: $? = 0
configure:22461: result: yes
configure:22465: checking sys/resource.h presence
configure:22480: gcc -E -I/usr/lib/syslinux/com32/include/ conftest.c
configure:22486: $? = 0
configure:22500: result: yes
configure:22528: checking for sys/resource.h
configure:22536: result: yes
configure:22424: checking sys/param.h usability
configure:22441: gcc -c -g -O2 -I/usr/lib/syslinux/com32/include/ 
conftest.c >&5
configure:22447: $? = 0
configure:22461: result: yes
configure:22465: checking sys/param.h presence
configure:22480: gcc -E -I/usr/lib/syslinux/com32/include/ conftest.c
configure:22486: $? = 0
configure:22500: result: yes
configure:22528: checking for sys/param.h
configure:22536: result: yes
configure:22550: checking for sys/wait.h that is POSIX.1 compatible
configure:22586: gcc -c -g -O2 -I/usr/lib/syslinux/com32/include/ 
conftest.c >&5
configure:22592: $? = 0
configure:22607: result: yes
configure:22618: checking for an ANSI C-conforming const
configure:22714: result: yes
configure:22724: checking for pid_t
configure:22754: gcc -c -g -O2 -I/usr/lib/syslinux/com32/include/ 
conftest.c >&5
conftest.c:61: error: expected '=', ',', ';', 'asm' or '__attribute__' 
before 'ac__type_new_'
conftest.c: In function 'main':
conftest.c:65: error: 'ac__type_new_' undeclared (first use in this 
function)
conftest.c:65: error: (Each undeclared identifier is reported only once
conftest.c:65: error: for each function it appears in.)
conftest.c:65: error: expected expression before ')' token
configure:22760: $? = 1
configure: failed program was:
| /* confdefs.h.  */
| #define PACKAGE_NAME ""
| #define PACKAGE_TARNAME ""
| #define PACKAGE_VERSION ""
| #define PACKAGE_STRING ""
| #define PACKAGE_BUGREPORT ""
| #define PACKAGE "swish-e"
| #define VERSION "2.4.5"
| #define HAVE_SYS_TYPES_H 1
| #define HAVE_SYS_STAT_H 1
| #define HAVE_STDLIB_H 1
| #define HAVE_STRING_H 1
| #define HAVE_MEMORY_H 1
| #define HAVE_STRINGS_H 1
| #define HAVE_INTTYPES_H 1
| #define HAVE_STDINT_H 1
| #define HAVE_UNISTD_H 1
| #define HAVE_DLFCN_H 1
| #define HAVE_DIRENT_H 1
| #define HAVE_UNISTD_H 1
| #define HAVE_STDLIB_H 1
| #define HAVE_STRING_H 1
| #define HAVE_SYS_TIMEB_H 1
| #define HAVE_SYS_RESOURCE_H 1
| #define HAVE_SYS_PARAM_H 1
| #define HAVE_SYS_WAIT_H 1
| /* end confdefs.h.  */
| #include <stdio.h>
| #ifdef HAVE_SYS_TYPES_H
| # include <sys/types.h>
| #endif
| #ifdef HAVE_SYS_STAT_H
| # include <sys/stat.h>
| #endif
| #ifdef STDC_HEADERS
| # include <stdlib.h>
| # include <stddef.h>
| #else
| # ifdef HAVE_STDLIB_H
| #  include <stdlib.h>
| # endif
| #endif
| #ifdef HAVE_STRING_H
| # if !defined STDC_HEADERS && defined HAVE_MEMORY_H
| #  include <memory.h>
| # endif
| # include <string.h>
| #endif
| #ifdef HAVE_STRINGS_H
| # include <strings.h>
| #endif
| #ifdef HAVE_INTTYPES_H
| # include <inttypes.h>
| #endif
| #ifdef HAVE_STDINT_H
| # include <stdint.h>
| #endif
| #ifdef HAVE_UNISTD_H
| # include <unistd.h>
| #endif
| typedef pid_t ac__type_new_;
| int
| main ()
| {
| if ((ac__type_new_ *) 0)
|   return 0;
| if (sizeof (ac__type_new_))
|   return 0;
|   ;
|   return 0;
| }
configure:22775: result: no
configure:22787: checking for size_t
configure:22817: gcc -c -g -O2 -I/usr/lib/syslinux/com32/include/ 
conftest.c >&5
configure:22823: $? = 0
configure:22838: result: yes
configure:22850: checking whether struct tm is in sys/time.h or time.h
configure:22880: gcc -c -g -O2 -I/usr/lib/syslinux/com32/include/ 
conftest.c >&5
In file included from conftest.c:30:
/usr/include/time.h:175: error: two or more data types in declaration 
specifiers
configure:22886: $? = 1
configure: failed program was:
| /* confdefs.h.  */
| #define PACKAGE_NAME ""
| #define PACKAGE_TARNAME ""
| #define PACKAGE_VERSION ""
| #define PACKAGE_STRING ""
| #define PACKAGE_BUGREPORT ""
| #define PACKAGE "swish-e"
| #define VERSION "2.4.5"
| #define HAVE_SYS_TYPES_H 1
| #define HAVE_SYS_STAT_H 1
| #define HAVE_STDLIB_H 1
| #define HAVE_STRING_H 1
| #define HAVE_MEMORY_H 1
| #define HAVE_STRINGS_H 1
| #define HAVE_INTTYPES_H 1
| #define HAVE_STDINT_H 1
| #define HAVE_UNISTD_H 1
| #define HAVE_DLFCN_H 1
| #define HAVE_DIRENT_H 1
| #define HAVE_UNISTD_H 1
| #define HAVE_STDLIB_H 1
| #define HAVE_STRING_H 1
| #define HAVE_SYS_TIMEB_H 1
| #define HAVE_SYS_RESOURCE_H 1
| #define HAVE_SYS_PARAM_H 1
| #define HAVE_SYS_WAIT_H 1
| #define pid_t int
| /* end confdefs.h.  */
| #include <sys/types.h>
| #include <time.h>
|
| int
| main ()
| {
| struct tm tm;
|                      int *p = &tm.tm_sec;
|                       return !p;
|   ;
|   return 0;
| }
configure:22901: result: sys/time.h
configure:22914: checking for working alloca.h
configure:22941: gcc -o conftest -g -O2 
-I/usr/lib/syslinux/com32/include/  conftest.c  >&5
configure:22947: $? = 0
configure:22964: result: yes
configure:22974: checking for alloca
configure:23021: gcc -o conftest -g -O2 
-I/usr/lib/syslinux/com32/include/  conftest.c  >&5
configure:23027: $? = 0
configure:23044: result: yes
configure:23275: checking for strftime
configure:23331: gcc -o conftest -g -O2 
-I/usr/lib/syslinux/com32/include/  conftest.c  >&5
conftest.c:55: warning: conflicting types for built-in function 'strftime'
configure:23337: $? = 0
configure:23355: result: yes
configure:23440: checking for vprintf
configure:23496: gcc -o conftest -g -O2 
-I/usr/lib/syslinux/com32/include/  conftest.c  >&5
conftest.c:56: warning: conflicting types for built-in function 'vprintf'
configure:23502: $? = 0
configure:23520: result: yes
configure:23527: checking for _doprnt
configure:23583: gcc -o conftest -g -O2 
-I/usr/lib/syslinux/com32/include/  conftest.c  >&5
/tmp/cc8FkVgS.o: In function `main':
/home/[directory]/swish-e-2.4.5/conftest.c:68: undefined reference to 
`_doprnt'
collect2: ld returned 1 exit status
configure:23589: $? = 1
configure: failed program was:
| /* confdefs.h.  */
| #define PACKAGE_NAME ""
| #define PACKAGE_TARNAME ""
| #define PACKAGE_VERSION ""
| #define PACKAGE_STRING ""
| #define PACKAGE_BUGREPORT ""
| #define PACKAGE "swish-e"
| #define VERSION "2.4.5"
| #define HAVE_SYS_TYPES_H 1
| #define HAVE_SYS_STAT_H 1
| #define HAVE_STDLIB_H 1
| #define HAVE_STRING_H 1
| #define HAVE_MEMORY_H 1
| #define HAVE_STRINGS_H 1
| #define HAVE_INTTYPES_H 1
| #define HAVE_STDINT_H 1
| #define HAVE_UNISTD_H 1
| #define HAVE_DLFCN_H 1
| #define HAVE_DIRENT_H 1
| #define HAVE_UNISTD_H 1
| #define HAVE_STDLIB_H 1
| #define HAVE_STRING_H 1
| #define HAVE_SYS_TIMEB_H 1
| #define HAVE_SYS_RESOURCE_H 1
| #define HAVE_SYS_PARAM_H 1
| #define HAVE_SYS_WAIT_H 1
| #define pid_t int
| #define TM_IN_SYS_TIME 1
| #define HAVE_ALLOCA_H 1
| #define HAVE_ALLOCA 1
| #define HAVE_STRFTIME 1
| #define HAVE_VPRINTF 1
| /* end confdefs.h.  */
| /* Define _doprnt to an innocuous variant, in case <limits.h> declares 
_doprnt.
|    For example, HP-UX 11i <limits.h> declares gettimeofday.  */
| #define _doprnt innocuous__doprnt
|
| /* System header to define __stub macros and hopefully few prototypes,
|     which can conflict with char _doprnt (); below.
|     Prefer <limits.h> to <assert.h> if __STDC__ is defined, since
|     <limits.h> exists even on freestanding compilers.  */
|
| #ifdef __STDC__
| # include <limits.h>
| #else
| # include <assert.h>
| #endif
|
| #undef _doprnt
|
| /* Override any GCC internal prototype to avoid an error.
|    Use char because int might match the return type of a GCC
|    builtin and then its argument prototype would still apply.  */
| #ifdef __cplusplus
| extern "C"
| #endif
| char _doprnt ();
| /* The GNU C library defines this for functions which it implements
|     to always fail with ENOSYS.  Some functions are actually named
|     something starting with __ and the normal name is an alias.  */
| #if defined __stub__doprnt || defined __stub____doprnt
| choke me
| #endif
|
| int
| main ()
| {
| return _doprnt ();
|   ;
|   return 0;
| }
configure:23606: result: no
configure:23635: checking vfork.h usability
configure:23652: gcc -c -g -O2 -I/usr/lib/syslinux/com32/include/ 
conftest.c >&5
conftest.c:67:19: error: vfork.h: No such file or directory
configure:23658: $? = 1
configure: failed program was:
| /* confdefs.h.  */
| #define PACKAGE_NAME ""
| #define PACKAGE_TARNAME ""
| #define PACKAGE_VERSION ""
| #define PACKAGE_STRING ""
| #define PACKAGE_BUGREPORT ""
| #define PACKAGE "swish-e"
| #define VERSION "2.4.5"
| #define HAVE_SYS_TYPES_H 1
| #define HAVE_SYS_STAT_H 1
| #define HAVE_STDLIB_H 1
| #define HAVE_STRING_H 1
| #define HAVE_MEMORY_H 1
| #define HAVE_STRINGS_H 1
| #define HAVE_INTTYPES_H 1
| #define HAVE_STDINT_H 1
| #define HAVE_UNISTD_H 1
| #define HAVE_DLFCN_H 1
| #define HAVE_DIRENT_H 1
| #define HAVE_UNISTD_H 1
| #define HAVE_STDLIB_H 1
| #define HAVE_STRING_H 1
| #define HAVE_SYS_TIMEB_H 1
| #define HAVE_SYS_RESOURCE_H 1
| #define HAVE_SYS_PARAM_H 1
| #define HAVE_SYS_WAIT_H 1
| #define pid_t int
| #define TM_IN_SYS_TIME 1
| #define HAVE_ALLOCA_H 1
| #define HAVE_ALLOCA 1
| #define HAVE_STRFTIME 1
| #define HAVE_VPRINTF 1
| /* end confdefs.h.  */
| #include <stdio.h>
| #ifdef HAVE_SYS_TYPES_H
| # include <sys/types.h>
| #endif
| #ifdef HAVE_SYS_STAT_H
| # include <sys/stat.h>
| #endif
| #ifdef STDC_HEADERS
| # include <stdlib.h>
| # include <stddef.h>
| #else
| # ifdef HAVE_STDLIB_H
| #  include <stdlib.h>
| # endif
| #endif
| #ifdef HAVE_STRING_H
| # if !defined STDC_HEADERS && defined HAVE_MEMORY_H
| #  include <memory.h>
| # endif
| # include <string.h>
| #endif
| #ifdef HAVE_STRINGS_H
| # include <strings.h>
| #endif
| #ifdef HAVE_INTTYPES_H
| # include <inttypes.h>
| #endif
| #ifdef HAVE_STDINT_H
| # include <stdint.h>
| #endif
| #ifdef HAVE_UNISTD_H
| # include <unistd.h>
| #endif
| #include <vfork.h>
configure:23672: result: no
configure:23676: checking vfork.h presence
configure:23691: gcc -E -I/usr/lib/syslinux/com32/include/ conftest.c
conftest.c:34:19: error: vfork.h: No such file or directory
configure:23697: $? = 1
configure: failed program was:
| /* confdefs.h.  */
| #define PACKAGE_NAME ""
| #define PACKAGE_TARNAME ""
| #define PACKAGE_VERSION ""
| #define PACKAGE_STRING ""
| #define PACKAGE_BUGREPORT ""
| #define PACKAGE "swish-e"
| #define VERSION "2.4.5"
| #define HAVE_SYS_TYPES_H 1
| #define HAVE_SYS_STAT_H 1
| #define HAVE_STDLIB_H 1
| #define HAVE_STRING_H 1
| #define HAVE_MEMORY_H 1
| #define HAVE_STRINGS_H 1
| #define HAVE_INTTYPES_H 1
| #define HAVE_STDINT_H 1
| #define HAVE_UNISTD_H 1
| #define HAVE_DLFCN_H 1
| #define HAVE_DIRENT_H 1
| #define HAVE_UNISTD_H 1
| #define HAVE_STDLIB_H 1
| #define HAVE_STRING_H 1
| #define HAVE_SYS_TIMEB_H 1
| #define HAVE_SYS_RESOURCE_H 1
| #define HAVE_SYS_PARAM_H 1
| #define HAVE_SYS_WAIT_H 1
| #define pid_t int
| #define TM_IN_SYS_TIME 1
| #define HAVE_ALLOCA_H 1
| #define HAVE_ALLOCA 1
| #define HAVE_STRFTIME 1
| #define HAVE_VPRINTF 1
| /* end confdefs.h.  */
| #include <vfork.h>
configure:23711: result: no
configure:23739: checking for vfork.h
configure:23747: result: no
configure:23765: checking for fork
configure:23821: gcc -o conftest -g -O2 
-I/usr/lib/syslinux/com32/include/  conftest.c  >&5
conftest.c:57: warning: conflicting types for built-in function 'fork'
configure:23827: $? = 0
configure:23845: result: yes
configure:23765: checking for vfork
configure:23821: gcc -o conftest -g -O2 
-I/usr/lib/syslinux/com32/include/  conftest.c  >&5
configure:23827: $? = 0
configure:23845: result: yes
configure:23856: checking for working fork
configure:23888: gcc -o conftest -g -O2 
-I/usr/lib/syslinux/com32/include/  conftest.c  >&5
configure:23891: $? = 0
configure:23897: ./conftest
configure:23900: $? = 0
configure:23916: result: yes
configure:23937: checking for working vfork
configure:24075: result: yes
configure:24111: checking for waitpid
configure:24167: gcc -o conftest -g -O2 
-I/usr/lib/syslinux/com32/include/  conftest.c  >&5
configure:24173: $? = 0
configure:24191: result: yes
configure:24111: checking for kill
configure:24167: gcc -o conftest -g -O2 
-I/usr/lib/syslinux/com32/include/  conftest.c  >&5
configure:24173: $? = 0
configure:24191: result: yes
configure:24211: checking for re_comp
configure:24267: gcc -o conftest -g -O2 
-I/usr/lib/syslinux/com32/include/  conftest.c  >&5
configure:24273: $? = 0
configure:24291: result: yes
configure:24211: checking for regcomp
configure:24267: gcc -o conftest -g -O2 
-I/usr/lib/syslinux/com32/include/  conftest.c  >&5
configure:24273: $? = 0
configure:24291: result: yes
configure:24211: checking for strdup
configure:24267: gcc -o conftest -g -O2 
-I/usr/lib/syslinux/com32/include/  conftest.c  >&5
conftest.c:65: warning: conflicting types for built-in function 'strdup'
configure:24273: $? = 0
configure:24291: result: yes
configure:24211: checking for strstr
configure:24267: gcc -o conftest -g -O2 
-I/usr/lib/syslinux/com32/include/  conftest.c  >&5
conftest.c:66: warning: conflicting types for built-in function 'strstr'
configure:24273: $? = 0
configure:24291: result: yes
configure:24211: checking for lstat
configure:24267: gcc -o conftest -g -O2 
-I/usr/lib/syslinux/com32/include/  conftest.c  >&5
configure:24273: $? = 0
configure:24291: result: yes
configure:24211: checking for setenv
configure:24267: gcc -o conftest -g -O2 
-I/usr/lib/syslinux/com32/include/  conftest.c  >&5
configure:24273: $? = 0
configure:24291: result: yes
configure:24211: checking for access
configure:24267: gcc -o conftest -g -O2 
-I/usr/lib/syslinux/com32/include/  conftest.c  >&5
configure:24273: $? = 0
configure:24291: result: yes
configure:24306: checking for strchr
configure:24362: gcc -o conftest -g -O2 
-I/usr/lib/syslinux/com32/include/  conftest.c  >&5
conftest.c:70: warning: conflicting types for built-in function 'strchr'
configure:24368: $? = 0
configure:24386: result: yes
configure:24306: checking for memcpy
configure:24362: gcc -o conftest -g -O2 
-I/usr/lib/syslinux/com32/include/  conftest.c  >&5
conftest.c:71: warning: conflicting types for built-in function 'memcpy'
configure:24368: $? = 0
configure:24386: result: yes
configure:24402: checking for clock
configure:24458: gcc -o conftest -g -O2 
-I/usr/lib/syslinux/com32/include/  conftest.c  >&5
configure:24464: $? = 0
configure:24482: result: yes
configure:24402: checking for times
configure:24458: gcc -o conftest -g -O2 
-I/usr/lib/syslinux/com32/include/  conftest.c  >&5
configure:24464: $? = 0
configure:24482: result: yes
configure:24402: checking for getrusage
configure:24458: gcc -o conftest -g -O2 
-I/usr/lib/syslinux/com32/include/  conftest.c  >&5
configure:24464: $? = 0
configure:24482: result: yes
configure:24493: checking for log in -lm
configure:24528: gcc -o conftest -g -O2 
-I/usr/lib/syslinux/com32/include/  conftest.c -lm   >&5
conftest.c:59: warning: conflicting types for built-in function 'log'
configure:24534: $? = 0
configure:24552: result: yes
configure:24564: checking for working strcoll
configure:24595: gcc -o conftest -g -O2 
-I/usr/lib/syslinux/com32/include/  conftest.c -lm  >&5
configure:24598: $? = 0
configure:24604: ./conftest
configure:24607: $? = 0
configure:24623: result: yes
configure:24634: checking for uid_t in sys/types.h
configure:24657: result: no
configure:24672: checking type of array argument to getgroups
configure:24716: gcc -o conftest -g -O2 
-I/usr/lib/syslinux/com32/include/  conftest.c -lm  >&5
configure:24719: $? = 0
configure:24725: ./conftest
configure:24728: $? = 0
configure:24763: result: gid_t
configure:24771: checking for getgroups
configure:24827: gcc -o conftest -g -O2 
-I/usr/lib/syslinux/com32/include/  conftest.c -lm  >&5
configure:24833: $? = 0
configure:24850: result: yes
configure:24928: checking for working getgroups
configure:24958: gcc -o conftest -g -O2 
-I/usr/lib/syslinux/com32/include/  conftest.c -lm  >&5
configure:24961: $? = 0
configure:24967: ./conftest
configure:24970: $? = 0
configure:24987: result: yes
configure:25000: checking type of array argument to getgroups
configure:25091: result: gid_t
configure:25105: checking for vsnprintf
configure:25161: gcc -o conftest -g -O2 
-I/usr/lib/syslinux/com32/include/  conftest.c -lm  >&5
conftest.c:82: warning: conflicting types for built-in function 'vsnprintf'
configure:25167: $? = 0
configure:25185: result: yes
configure:25105: checking for mkstemp
configure:25161: gcc -o conftest -g -O2 
-I/usr/lib/syslinux/com32/include/  conftest.c -lm  >&5
configure:25167: $? = 0
configure:25185: result: yes
configure:25265: checking for xml2-config
configure:25296: result: no
configure:25318: result: Not building with libxml2 - use --with-libxml2 
to enable
configure:25427: checking zlib.h usability
configure:25444: gcc -c -g -O2 -I/usr/lib/syslinux/com32/include/ 
conftest.c >&5
configure:25450: $? = 0
configure:25464: result: yes
configure:25468: checking zlib.h presence
configure:25483: gcc -E -I/usr/lib/syslinux/com32/include/ conftest.c
configure:25489: $? = 0
configure:25503: result: yes
configure:25531: checking for zlib.h
configure:25539: result: yes
configure:25547: checking for gzread in -lz
configure:25582: gcc -o conftest -g -O2 
-I/usr/lib/syslinux/com32/include/  conftest.c -lz  -lm  >&5
/usr/bin/ld: cannot find -lz
collect2: ld returned 1 exit status
configure:25588: $? = 1
configure: failed program was:
| /* confdefs.h.  */
| #define PACKAGE_NAME ""
| #define PACKAGE_TARNAME ""
| #define PACKAGE_VERSION ""
| #define PACKAGE_STRING ""
| #define PACKAGE_BUGREPORT ""
| #define PACKAGE "swish-e"
| #define VERSION "2.4.5"
| #define HAVE_SYS_TYPES_H 1
| #define HAVE_SYS_STAT_H 1
| #define HAVE_STDLIB_H 1
| #define HAVE_STRING_H 1
| #define HAVE_MEMORY_H 1
| #define HAVE_STRINGS_H 1
| #define HAVE_INTTYPES_H 1
| #define HAVE_STDINT_H 1
| #define HAVE_UNISTD_H 1
| #define HAVE_DLFCN_H 1
| #define HAVE_DIRENT_H 1
| #define HAVE_UNISTD_H 1
| #define HAVE_STDLIB_H 1
| #define HAVE_STRING_H 1
| #define HAVE_SYS_TIMEB_H 1
| #define HAVE_SYS_RESOURCE_H 1
| #define HAVE_SYS_PARAM_H 1
| #define HAVE_SYS_WAIT_H 1
| #define pid_t int
| #define TM_IN_SYS_TIME 1
| #define HAVE_ALLOCA_H 1
| #define HAVE_ALLOCA 1
| #define HAVE_STRFTIME 1
| #define HAVE_VPRINTF 1
| #define HAVE_FORK 1
| #define HAVE_VFORK 1
| #define HAVE_WORKING_VFORK 1
| #define HAVE_WORKING_FORK 1
| #define HAVE_WAITPID 1
| #define HAVE_KILL 1
| #define HAVE_RE_COMP 1
| #define HAVE_REGCOMP 1
| #define HAVE_STRDUP 1
| #define HAVE_STRSTR 1
| #define HAVE_LSTAT 1
| #define HAVE_SETENV 1
| #define HAVE_ACCESS 1
| #define HAVE_STRCHR 1
| #define HAVE_MEMCPY 1
| #define HAVE_CLOCK 1
| #define HAVE_TIMES 1
| #define HAVE_GETRUSAGE 1
| #define HAVE_LIBM 1
| #define HAVE_STRCOLL 1
| #define uid_t int
| #define gid_t int
| #define GETGROUPS_T gid_t
| #define HAVE_GETGROUPS 1
| #define GETGROUPS_T gid_t
| #define HAVE_VSNPRINTF 1
| #define HAVE_MKSTEMP 1
| #define HAVE_ZLIB_H 1
| /* end confdefs.h.  */
|
| /* Override any GCC internal prototype to avoid an error.
|    Use char because int might match the return type of a GCC
|    builtin and then its argument prototype would still apply.  */
| #ifdef __cplusplus
| extern "C"
| #endif
| char gzread ();
| int
| main ()
| {
| return gzread ();
|   ;
|   return 0;
| }
configure:25606: result: no
configure:25783: result: Not building with perl compatible regex - use 
--with-pcre to enable
configure:25793: Setting libexecdir to ${exec_prefix}/lib/swish-e
configure:25798: checking config option memdebug for setting MEM_DEBUG
configure:25807: result: no
configure:25816: checking config option memtrace for setting MEM_TRACE
configure:25825: result: no
configure:25834: checking config option memstats for setting MEM_STATISTICS
configure:25843: result: no
configure:26035: creating ./config.status

## ---------------------- ##
## Running config.status. ##
## ---------------------- ##

This file was extended by config.status, which was
generated by GNU Autoconf 2.61.  Invocation command line was

  CONFIG_FILES    =
  CONFIG_HEADERS  =
  CONFIG_LINKS    =
  CONFIG_COMMANDS =
  $ ./config.status

on server.server.com

config.status:702: creating Makefile
config.status:702: creating html/Makefile
config.status:702: creating pod/Makefile
config.status:702: creating man/Makefile
config.status:702: creating src/Makefile
config.status:702: creating src/expat/Makefile
config.status:702: creating src/replace/Makefile
config.status:702: creating src/snowball/Makefile
config.status:702: creating rpm/swish-e.spec
config.status:702: creating tests/Makefile
config.status:702: creating example/Makefile
config.status:702: creating prog-bin/Makefile
config.status:702: creating filters/Makefile
config.status:702: creating filters/SWISH/Makefile
config.status:702: creating conf/Makefile
config.status:702: creating filter-bin/Makefile
config.status:702: creating swish-e.pc
config.status:702: creating swish-config
config.status:702: creating src/acconfig.h
config.status:1018: executing depfiles commands

## ---------------- ##
## Cache variables. ##
## ---------------- ##

ac_cv_build=i686-pc-linux-gnu
ac_cv_c_compiler_gnu=yes
ac_cv_c_const=yes
ac_cv_cxx_compiler_gnu=no
ac_cv_env_CCC_set=
ac_cv_env_CCC_value=
ac_cv_env_CC_set=
ac_cv_env_CC_value=
ac_cv_env_CFLAGS_set=
ac_cv_env_CFLAGS_value=
ac_cv_env_CPPFLAGS_set=set
ac_cv_env_CPPFLAGS_value=-I/usr/lib/syslinux/com32/include/
ac_cv_env_CPP_set=
ac_cv_env_CPP_value=
ac_cv_env_CXXCPP_set=
ac_cv_env_CXXCPP_value=
ac_cv_env_CXXFLAGS_set=
ac_cv_env_CXXFLAGS_value=
ac_cv_env_CXX_set=
ac_cv_env_CXX_value=
ac_cv_env_F77_set=
ac_cv_env_F77_value=
ac_cv_env_FFLAGS_set=
ac_cv_env_FFLAGS_value=
ac_cv_env_LDFLAGS_set=
ac_cv_env_LDFLAGS_value=
ac_cv_env_LIBS_set=
ac_cv_env_LIBS_value=
ac_cv_env_build_alias_set=
ac_cv_env_build_alias_value=
ac_cv_env_host_alias_set=
ac_cv_env_host_alias_value=
ac_cv_env_target_alias_set=
ac_cv_env_target_alias_value=
ac_cv_f77_compiler_gnu=no
ac_cv_func_BSDgettimeofday=no
ac_cv_func__doprnt=no
ac_cv_func_access=yes
ac_cv_func_alloca_works=yes
ac_cv_func_clock=yes
ac_cv_func_fork=yes
ac_cv_func_fork_works=yes
ac_cv_func_getgroups=yes
ac_cv_func_getgroups_works=yes
ac_cv_func_getrusage=yes
ac_cv_func_gettimeofday=yes
ac_cv_func_kill=yes
ac_cv_func_lstat=yes
ac_cv_func_memcpy=yes
ac_cv_func_mkstemp=yes
ac_cv_func_re_comp=yes
ac_cv_func_regcomp=yes
ac_cv_func_setenv=yes
ac_cv_func_strchr=yes
ac_cv_func_strcoll_works=yes
ac_cv_func_strdup=yes
ac_cv_func_strftime=yes
ac_cv_func_strstr=yes
ac_cv_func_times=yes
ac_cv_func_vfork=yes
ac_cv_func_vfork_works=yes
ac_cv_func_vprintf=yes
ac_cv_func_vsnprintf=yes
ac_cv_func_waitpid=yes
ac_cv_header_dirent_dirent_h=yes
ac_cv_header_dlfcn_h=yes
ac_cv_header_inttypes_h=yes
ac_cv_header_memory_h=yes
ac_cv_header_stat_broken=no
ac_cv_header_stdc=no
ac_cv_header_stdint_h=yes
ac_cv_header_stdlib_h=yes
ac_cv_header_string_h=yes
ac_cv_header_strings_h=yes
ac_cv_header_sys_param_h=yes
ac_cv_header_sys_resource_h=yes
ac_cv_header_sys_stat_h=yes
ac_cv_header_sys_timeb_h=yes
ac_cv_header_sys_types_h=yes
ac_cv_header_sys_wait_h=yes
ac_cv_header_unistd_h=yes
ac_cv_header_vfork_h=no
ac_cv_header_windows_h=no
ac_cv_header_zlib_h=yes
ac_cv_host=i686-pc-linux-gnu
ac_cv_lib_m_log=yes
ac_cv_lib_snprintf_vsnprintf=no
ac_cv_lib_z_gzread=no
ac_cv_objext=o
ac_cv_path_EGREP='/bin/grep -E'
ac_cv_path_GREP=/bin/grep
ac_cv_path_PERL=/usr/bin/perl
ac_cv_path_XML2_CONFIG=no
ac_cv_path_install='/usr/bin/install -c'
ac_cv_prog_AWK=gawk
ac_cv_prog_CPP='gcc -E'
ac_cv_prog_POD2MAN=pod2man
ac_cv_prog_ac_ct_AR=ar
ac_cv_prog_ac_ct_CC=gcc
ac_cv_prog_ac_ct_RANLIB=ranlib
ac_cv_prog_ac_ct_STRIP=strip
ac_cv_prog_cc_c89=
ac_cv_prog_cc_g=yes
ac_cv_prog_cxx_g=no
ac_cv_prog_f77_g=no
ac_cv_prog_make_make_set=yes
ac_cv_search_opendir='none required'
ac_cv_struct_tm=sys/time.h
ac_cv_sys_interpreter=yes
ac_cv_type_getgroups=gid_t
ac_cv_type_pid_t=no
ac_cv_type_size_t=yes
ac_cv_type_uid_t=no
ac_cv_working_alloca_h=yes
am_cv_CC_dependencies_compiler_type=gcc3
am_cv_CXX_dependencies_compiler_type=none
am_cv_prog_cc_stdc=
lt_cv_deplibs_check_method=pass_all
lt_cv_file_magic_cmd='$MAGIC_CMD'
lt_cv_file_magic_test_file=
lt_cv_ld_reload_flag=-r
lt_cv_objdir=.libs
lt_cv_path_LD=/usr/bin/ld
lt_cv_path_NM='/usr/bin/nm -B'
lt_cv_path_SED=/bin/sed
lt_cv_prog_compiler_c_o=yes
lt_cv_prog_compiler_rtti_exceptions=no
lt_cv_prog_gnu_ld=yes
lt_cv_sys_global_symbol_pipe='sed -n -e '\''s/^.*[     
]\([ABCDGIRSTW][ABCDGIRSTW]*\)[     ][     
]*\([_A-Za-z][_A-Za-z0-9]*\)$/\1 \2 \2/p'\'''
lt_cv_sys_global_symbol_to_c_name_address='sed -n -e '\''s/^: \([^ ]*\) 
$/  {\"\1\", (lt_ptr) 0},/p'\'' -e '\''s/^[BCDEGRST] \([^ ]*\) \([^ 
]*\)$/  {"\2", (lt_ptr) \&\2},/p'\'''
lt_cv_sys_global_symbol_to_cdecl='sed -n -e '\''s/^. .* \(.*\)$/extern 
int \1;/p'\'''
lt_cv_sys_max_cmd_len=32768
lt_lt_cv_prog_compiler_c_o='"yes"'
lt_lt_cv_sys_global_symbol_pipe='"sed -n -e '\''s/^.*[     
]\\([ABCDGIRSTW][ABCDGIRSTW]*\\)[     ][     
]*\\([_A-Za-z][_A-Za-z0-9]*\\)\$/\\1 \\2 \\2/p'\''"'
lt_lt_cv_sys_global_symbol_to_c_name_address='"sed -n -e '\''s/^: \\([^ 
]*\\) \$/  {\\\"\\1\\\", (lt_ptr) 0},/p'\'' -e '\''s/^[BCDEGRST] \\([^ 
]*\\) \\([^ ]*\\)\$/  {\"\\2\", (lt_ptr) \\&\\2},/p'\''"'
lt_lt_cv_sys_global_symbol_to_cdecl='"sed -n -e '\''s/^. .* 
\\(.*\\)\$/extern int \\1;/p'\''"'

## ----------------- ##
## Output variables. ##
## ----------------- ##

ACLOCAL='${SHELL} /home/[directory]/swish-e-2.4.5/config/missing --run 
aclocal-1.9'
ALLOCA=''
AMDEPBACKSLASH='\'
AMDEP_FALSE='#'
AMDEP_TRUE=''
AMTAR='${SHELL} /home/[directory]/swish-e-2.4.5/config/missing --run tar'
AR='ar'
AS='as'
AUTOCONF='${SHELL} /home/[directory]/swish-e-2.4.5/config/missing --run 
autoconf'
AUTOHEADER='${SHELL} /home/[directory]/swish-e-2.4.5/config/missing 
--run autoheader'
AUTOMAKE='${SHELL} /home/[directory]/swish-e-2.4.5/config/missing --run 
automake-1.9'
AWK='gawk'
BTREE_OBJS=''
BUILDDOCS_FALSE=''
BUILDDOCS_TRUE='#'
CC='gcc'
CCDEPMODE='depmode=gcc3'
CFLAGS='-g -O2'
CPP='gcc -E'
CPPFLAGS='-I/usr/lib/syslinux/com32/include/'
CXX='g++'
CXXCPP=''
CXXDEPMODE='depmode=none'
CXXFLAGS=''
CYGPATH_W='echo'
DEFS='-DHAVE_CONFIG_H'
DEPDIR='.deps'
DLLTOOL='dlltool'
ECHO='echo'
ECHO_C=''
ECHO_N='-n'
ECHO_T=''
EGREP='/bin/grep -E'
EXEEXT=''
F77=''
FFLAGS=''
GREP='/bin/grep'
INSTALLDOCS_FALSE='#'
INSTALLDOCS_TRUE=''
INSTALL_DATA='${INSTALL} -m 644'
INSTALL_PROGRAM='${INSTALL}'
INSTALL_SCRIPT='${INSTALL}'
INSTALL_STRIP_PROGRAM='${SHELL} $(install_sh) -c -s'
LDFLAGS=''
LIBOBJS=''
LIBS='-lm '
LIBTOOL='$(SHELL) $(top_builddir)/libtool'
LIBXML2_CFLAGS=''
LIBXML2_LIB=''
LIBXML2_OBJS=''
LIBXML_REQUIRED_VERSION='2.4.3'
LN_S='ln -s'
LTLIBOBJS=''
MAINT='#'
MAINTAINER_MODE_FALSE=''
MAINTAINER_MODE_TRUE='#'
MAKEINFO='${SHELL} /home/[directory]/swish-e-2.4.5/config/missing --run 
makeinfo'
OBJDUMP='objdump'
OBJEXT='o'
PACKAGE='swish-e'
PACKAGE_BUGREPORT=''
PACKAGE_NAME=''
PACKAGE_STRING=''
PACKAGE_TARNAME=''
PACKAGE_VERSION=''
PATH_SEPARATOR=':'
PCRE_CFLAGS=''
PCRE_CONFIG=''
PCRE_LIBS=''
PCRE_REQUIRED_VERSION='3.4'
PERL='/usr/bin/perl'
POD2MAN='pod2man'
RANLIB='ranlib'
SET_MAKE=''
SHELL='/bin/sh'
STRIP='strip'
SWISH_WEB=''
VERSION='2.4.5'
XML2_CONFIG='no'
Z_CFLAGS=''
Z_LIBS=''
ac_ct_CC='gcc'
ac_ct_CXX=''
ac_ct_F77=''
am__fastdepCC_FALSE='#'
am__fastdepCC_TRUE=''
am__fastdepCXX_FALSE=''
am__fastdepCXX_TRUE='#'
am__include='include'
am__leading_dot='.'
am__quote=''
am__tar='${AMTAR} chof - "$$tardir"'
am__untar='${AMTAR} xf -'
bindir='${exec_prefix}/bin'
build='i686-pc-linux-gnu'
build_alias=''
build_cpu='i686'
build_os='linux-gnu'
build_vendor='pc'
datadir='${datarootdir}'
datarootdir='${prefix}/share'
docdir='${datarootdir}/doc/${PACKAGE}'
dvidir='${docdir}'
exec_prefix='${prefix}'
host='i686-pc-linux-gnu'
host_alias=''
host_cpu='i686'
host_os='linux-gnu'
host_vendor='pc'
htmldir='${docdir}'
includedir='${prefix}/include'
infodir='${datarootdir}/info'
install_sh='/home/[directory]/swish-e-2.4.5/config/install-sh'
libdir='${exec_prefix}/lib'
libexecdir='${exec_prefix}/lib/${PACKAGE}'
localedir='${datarootdir}/locale'
localstatedir='${prefix}/var'
mandir='${datarootdir}/man'
mkdir_p='mkdir -p --'
oldincludedir='/usr/include'
pdfdir='${docdir}'
prefix='/usr/local'
program_transform_name='s,x,x,'
psdir='${docdir}'
sbindir='${exec_prefix}/sbin'
sharedstatedir='${prefix}/com'
sysconfdir='${prefix}/etc'
target_alias=''

## ----------- ##
## confdefs.h. ##
## ----------- ##

#define PACKAGE_NAME ""
#define PACKAGE_TARNAME ""
#define PACKAGE_VERSION ""
#define PACKAGE_STRING ""
#define PACKAGE_BUGREPORT ""
#define PACKAGE "swish-e"
#define VERSION "2.4.5"
#define HAVE_SYS_TYPES_H 1
#define HAVE_SYS_STAT_H 1
#define HAVE_STDLIB_H 1
#define HAVE_STRING_H 1
#define HAVE_MEMORY_H 1
#define HAVE_STRINGS_H 1
#define HAVE_INTTYPES_H 1
#define HAVE_STDINT_H 1
#define HAVE_UNISTD_H 1
#define HAVE_DLFCN_H 1
#define HAVE_DIRENT_H 1
#define HAVE_UNISTD_H 1
#define HAVE_STDLIB_H 1
#define HAVE_STRING_H 1
#define HAVE_SYS_TIMEB_H 1
#define HAVE_SYS_RESOURCE_H 1
#define HAVE_SYS_PARAM_H 1
#define HAVE_SYS_WAIT_H 1
#define pid_t int
#define TM_IN_SYS_TIME 1
#define HAVE_ALLOCA_H 1
#define HAVE_ALLOCA 1
#define HAVE_STRFTIME 1
#define HAVE_VPRINTF 1
#define HAVE_FORK 1
#define HAVE_VFORK 1
#define HAVE_WORKING_VFORK 1
#define HAVE_WORKING_FORK 1
#define HAVE_WAITPID 1
#define HAVE_KILL 1
#define HAVE_RE_COMP 1
#define HAVE_REGCOMP 1
#define HAVE_STRDUP 1
#define HAVE_STRSTR 1
#define HAVE_LSTAT 1
#define HAVE_SETENV 1
#define HAVE_ACCESS 1
#define HAVE_STRCHR 1
#define HAVE_MEMCPY 1
#define HAVE_CLOCK 1
#define HAVE_TIMES 1
#define HAVE_GETRUSAGE 1
#define HAVE_LIBM 1
#define HAVE_STRCOLL 1
#define uid_t int
#define gid_t int
#define GETGROUPS_T gid_t
#define HAVE_GETGROUPS 1
#define GETGROUPS_T gid_t
#define HAVE_VSNPRINTF 1
#define HAVE_MKSTEMP 1
#define HAVE_ZLIB_H 1

configure: exit 0

make info:

make
Making all in filters
make[1]: Entering directory `/home/[directory]/swish-e-2.4.5/filters'
Making all in SWISH
make[2]: Entering directory `/home/[directory]/swish-e-2.4.5/filters/SWISH'
make[2]: Nothing to be done for `all'.
make[2]: Leaving directory `/home/[directory]/swish-e-2.4.5/filters/SWISH'
make[2]: Entering directory `/home/[directory]/swish-e-2.4.5/filters'
make[2]: Nothing to be done for `all-am'.
make[2]: Leaving directory `/home/[directory]/swish-e-2.4.5/filters'
make[1]: Leaving directory `/home/[directory]/swish-e-2.4.5/filters'
Making all in prog-bin
make[1]: Entering directory `/home/[directory]/swish-e-2.4.5/prog-bin'
make[1]: Nothing to be done for `all'.
make[1]: Leaving directory `/home/[directory]/swish-e-2.4.5/prog-bin'
Making all in conf
make[1]: Entering directory `/home/[directory]/swish-e-2.4.5/conf'
make[1]: Nothing to be done for `all'.
make[1]: Leaving directory `/home/[directory]/swish-e-2.4.5/conf'
Making all in filter-bin
make[1]: Entering directory `/home/[directory]/swish-e-2.4.5/filter-bin'
make[1]: Nothing to be done for `all'.
make[1]: Leaving directory `/home/[directory]/swish-e-2.4.5/filter-bin'
Making all in example
make[1]: Entering directory `/home/[directory]/swish-e-2.4.5/example'
make[1]: Nothing to be done for `all'.
make[1]: Leaving directory `/home/[directory]/swish-e-2.4.5/example'
Making all in html
make[1]: Entering directory `/home/[directory]/swish-e-2.4.5/html'
make[1]: Nothing to be done for `all'.
make[1]: Leaving directory `/home/[directory]/swish-e-2.4.5/html'
Making all in man
make[1]: Entering directory `/home/[directory]/swish-e-2.4.5/man'
make[1]: Nothing to be done for `all'.
make[1]: Leaving directory `/home/[directory]/swish-e-2.4.5/man'
Making all in src
make[1]: Entering directory `/home/[directory]/swish-e-2.4.5/src'
make  all-recursive
make[2]: Entering directory `/home/[directory]/swish-e-2.4.5/src'
Making all in expat
make[3]: Entering directory `/home/[directory]/swish-e-2.4.5/src/expat'
make[3]: Nothing to be done for `all'.
make[3]: Leaving directory `/home/[directory]/swish-e-2.4.5/src/expat'
Making all in replace
make[3]: Entering directory `/home/[directory]/swish-e-2.4.5/src/replace'
make[3]: Nothing to be done for `all'.
make[3]: Leaving directory `/home/[directory]/swish-e-2.4.5/src/replace'
Making all in snowball
make[3]: Entering directory `/home/[directory]/swish-e-2.4.5/src/snowball'
make[3]: Nothing to be done for `all'.
make[3]: Leaving directory `/home/[directory]/swish-e-2.4.5/src/snowball'
make[3]: Entering directory `/home/[directory]/swish-e-2.4.5/src'
if /bin/sh ../libtool --tag=CC --mode=compile gcc -DHAVE_CONFIG_H -I. 
-I. -I.  -Dlibexecdir=\"/usr/local/lib/swish-e\" 
-DPATH_SEPARATOR=\":\"    -Ireplace -I/usr/lib/syslinux/com32/include/ 
-Wall -g -O2 -MT search.lo -MD -MP -MF ".deps/search.Tpo" -c -o 
search.lo search.c; \
    then mv -f ".deps/search.Tpo" ".deps/search.Plo"; else rm -f 
".deps/search.Tpo"; exit 1; fi
 gcc -DHAVE_CONFIG_H -I. -I. -I. -Dlibexecdir=\"/usr/local/lib/swish-e\" 
-DPATH_SEPARATOR=\":\" -Ireplace -I/usr/lib/syslinux/com32/include/ 
-Wall -g -O2 -MT search.lo -MD -MP -MF .deps/search.Tpo -c search.c  
-fPIC -DPIC -o .libs/search.o
In file included from search.c:128:
index.h:37: error: expected specifier-qualifier-list before 'dev_t'
search.c: In function 'getfileinfo':
search.c:1576: warning: pointer targets in assignment differ in signedness
search.c:1587: warning: pointer targets in passing argument 2 of 
'strcpy' differ in signedness
search.c:1593: warning: pointer targets in passing argument 2 of 
'strcpy' differ in signedness
search.c:1625: warning: dereferencing type-punned pointer will break 
strict-aliasing rules
search.c:1634: warning: pointer targets in passing argument 2 of 
'strcpy' differ in signedness
search.c:1701: warning: dereferencing type-punned pointer will break 
strict-aliasing rules
search.c:1705: warning: pointer targets in passing argument 2 of 
'strcpy' differ in signedness
search.c:1816: warning: dereferencing type-punned pointer will break 
strict-aliasing rules
search.c:1821: warning: pointer targets in passing argument 2 of 
'strcpy' differ in signedness
make[3]: *** [search.lo] Error 1
make[3]: Leaving directory `/home/[directory]/swish-e-2.4.5/src'
make[2]: *** [all-recursive] Error 1
make[2]: Leaving directory `/home/[directory]/swish-e-2.4.5/src'
make[1]: *** [all] Error 2
make[1]: Leaving directory `/home/[directory]/swish-e-2.4.5/src'
make: *** [all-recursive] Error 1
_______________________________________________
Users mailing list
Users@lists.swish-e.org
http://lists.swish-e.org/listinfo/users
Received on Wed Aug 20 16:59:05 2008